SAREF extension for Smart Lifts
type: Ontology
version IRI: v1.1.1
description: This ontology extends the SAREF ontology for the Smart Lifts domain.
license: etsi-software-license
modified: 2021-03-05
publisher: www.etsi.org
source: saref4lift
preferred namespace prefix: s4lift
version info: v1.1.1

hasGeometry
type: ObjectProperty

hasCommand
type: ObjectProperty
domain: Function
range: Command
comment: A relationship between a function and a command
comment: has command

is measured in
type: ObjectProperty
comment: A relationship identifying the unit of measure used for a certain entity.

relates to property
type: ObjectProperty
comment: A relationship between a measurement and the property it relates to

has door close time
type: ObjectProperty
domain: Smart lift Installation
range: Time
comment: A relationship defining the time spent by a lift to close its doors

has door open time
type: ObjectProperty
domain: Smart lift Installation
range: Time
comment: A relationship defining the time spent by a lift to open its doors

has limit load
type: ObjectProperty
range: Load
comment: A relationship defining the limit load of a lift

has power supply
type: ObjectProperty
range: Power
comment: A relationship defining the value of the main power supply of a lift

has standard power supply
type: ObjectProperty
range: Power
comment: A relationship defining the value of the standard power supply of a lift

has travel time
type: ObjectProperty
domain: Smart lift Installation
range: Time
comment: A relationship defining the time spent by a lift to travel between car stops

is associated to
type: ObjectProperty
domain: Signal
range: FeatureOfInterest
comment: A relationship specifying the features of interest that are associated to a signal

is grouped in
type: ObjectProperty
domain: Smart lift Installation
range: Smart Lift Group
comment: A relationship specifying the smart lift installations grouped into smart lift groups

receives
type: ObjectProperty
range: Bidirectional communication system signal

sends command
type: ObjectProperty
range: Command

supports network technology
type: ObjectProperty
comment: A relationship to determine the supported network technologies of the lift. Examples of technologies are 2G, 3G,4G, 5G and fixed line.

has sub system
type: ObjectProperty
comment: Links a system to one of its sub systems.

has function
type: ObjectProperty
domain: Device
range: Function
comment: A relationship identifying the function of a device

has manufacturer
type: DatatypeProperty
comment: A relationship identifying the manufacturer of an entity (e.g., device). The value is expected to be a string or a string with language tag.

has timestamp
type: DatatypeProperty
comment: A relationship stating the timestamp of an entity (e.g. a measurement).

has value
type: DatatypeProperty

has building manager
type: DatatypeProperty
range: string
comment: A relationship identifying the building manager of the lift.

has car stops
type: DatatypeProperty
range: integer
label: The number of car stops in a lift

has door status
type: DatatypeProperty
range: boolean
label: Status of the door. TRUE indicates that indicates that the corresponding port identified by the array index is open at the given stop. FALSE indicates that the port is closed.

has installer company
type: DatatypeProperty
range: string
comment: A relationship identifying the installer company of an entity.

has location validator
type: DatatypeProperty
range: string
comment: Name of who has provided the validation of the correctness of the location of the entity

has main emergency number
type: DatatypeProperty
range: string
comment: Main emergency numbers to be called in case of emergency

has maintenance company
type: DatatypeProperty
range: string
comment: A relationship identifying the maintenance company of an entity.

has network value
type: DatatypeProperty
domain: Registered network operator
range: string

has owner
type: DatatypeProperty
range: string
comment: A relationship identifying the owner of an entity.

has position value
type: DatatypeProperty
domain: Position signal
range: integer

has power supply value
type: DatatypeProperty
domain: Emergency power supply signal
domain: Standard emergency power supply signal
range: boolean

has secondary emergency telephone number
type: DatatypeProperty
domain: Smart lift Installation
range: string
comment: Secondary emergency numbers to be called in case of emergency.

has statistic value
type: DatatypeProperty
domain: Statistic signal
range: integer

has status value
type: DatatypeProperty
domain: Status signal
range: boolean

has telephone number
type: DatatypeProperty
range: string
comment: Number corresponding to the lift communication module to be used for call terminated to the lift car.

Feature
type: Class
subclass of: Spatial object
comment: This class represents the top-level feature type. This class is equivalent to GFI_Feature defined in ISO 19156:2011, and it is superclass of all feature types.

Geometry
type: Class
subclass of: Spatial object
comment: The class represents the top-level geometry type. This class is equivalent to the UML class GM_Object defined in ISO 19107, and it is superclass of all geometry types.

Spatial object
type: Class

Command
type: Class
comment: A directive that a device must support to perform a certain function. A command may act upon a state, but does not necessarily act upon a state. For example, the ON command acts upon the ON/OFF state, but the GET command does not act upon any state, it simply gives a directive to retrieve a certain value

Device
type: Class
comment: A tangible object designed to accomplish a particular task. In order to accomplish this task, the device performs one or more functions. For example, a washing machine is designed to wash (task) and to accomplish this task it performs a start and stop function.

FeatureOfInterest
type: Class
comment: A feature of interest represents any real world entity from which a property is measured.

Function
type: Class
comment: The functionality necessary to accomplish the task for which a device is designed. A device can be designed to perform more than one function. Functions can be structured in categories (subclasses) that reflect different points of view, for example, considering the specific application area for which a function can be used (e.g., light, temperature, motion, heat, power, etc.), or the capability that a function can support (e.g., receive, reply, notify, etc.), and so forth.

Measurement
type: Class
subclass of: Restriction
  on property: relates to property
  all values from: Property
subclass of: Restriction
  on property: is measured in
  qualified cardinality: 1
  on class: Unit of measure
subclass of: Restriction
  on property: relates to property
  qualified cardinality: 1
  on class: Property
comment: Represents the measured value made over a property. It is also linked to the unit of measure in which the value is expressed and the timestamp of the measurement.

Power
type: Class
subclass of: Property
comment: A saref:Property related to some measurements that are characterized by a certain value that is measured in a power unit (such as watt or kilowatt). Further specializations of the saref:Power class can be found in the SAREF4ENER extension, where classes such as PowerMax, PowerMin and PowerExpected are defined.

Property
type: Class
comment: A quality of a feature of interest that can be measured; an aspect of a feature of interest that is intrinsic to and cannot exist without the feature

Time
type: Class
comment: A class that allows to specify the time concept.

Unit of measure
type: Class
comment: The unit of measure is a standard for measurement of a quantity, such as a Property. For example, Power is a property and Watt is a unit of power that represents a definite predetermined power: when we say 10 Watt, we actually mean 10 times the definite predetermined power called \"watt\". Our definition is based on the definition of unit of measure in the Ontology of units of Measure (OM). We propose here a list of some units of measure that are relevant for the purpose of the Smart Appliances ontology, but this list can be extended.

Alarm
type: Class
subclass of: Status signal

Alarm in the machinery
type: Class
subclass of: Alarm

Alarm in the well
type: Class
subclass of: Alarm

Alarm voice communication
type: Class
subclass of: Alarm

Audio signal
type: Class
subclass of: Fault signal

Bidirectional communication system signal
type: Class
subclass of: Signal

Board reset command
type: Class
subclass of: Command
comment: A type of command to initiate the board reset

Call car to specific floor command
type: Class
subclass of: Command
comment: A type of command to call a car to a specific floor

Call per service
type: Class
subclass of: Statistic signal

Car alarm
type: Class
subclass of: Alarm

Car in unlocking zone
type: Class
subclass of: Status signal

Car signal
type: Class
subclass of: Signal

Current car stop
type: Class
subclass of: Position signal

Dangerous signal
type: Class
subclass of: Fault signal

Downward travels
type: Class
subclass of: Statistic signal

Emergency power alarm
type: Class
subclass of: Alarm

Emergency power supply signal
type: Class
subclass of: Power supply signal

Fault signal
type: Class
subclass of: Car signal

Fire operation
type: Class
subclass of: Status signal

Fireman lift
type: Class
subclass of: Smart lift Installation

Flood alarm
type: Class
subclass of: Alarm

Goods only smart lift
type: Class
subclass of: Smart lift Installation

Goods smart lift
type: Class
subclass of: Smart lift Installation

Inspection operation
type: Class
subclass of: Status signal

Load
type: Class
subclass of: Property
comment: A saref:Property related to the amount of electricity on the grid at any given time

Minor fault
type: Class
subclass of: Fault signal

Moving downward direction
type: Class
subclass of: Status signal

Moving upward direction
type: Class
subclass of: Status signal

Network
type: Class

Network coverage
type: Class
subclass of: Bidirectional communication system signal

Network quality BER
type: Class
subclass of: Bidirectional communication system signal

Network quality RSSI
type: Class
subclass of: Bidirectional communication system signal

Number of calls
type: Class
subclass of: Statistic signal

Number of faults
type: Class
subclass of: Statistic signal

Out of service
type: Class
subclass of: Status signal

Overload
type: Class
subclass of: Status signal

Position signal
type: Class
subclass of: Car signal

Power supply signal
type: Class
subclass of: Signal

Registered network operator
type: Class
subclass of: Bidirectional communication system signal

Send car to specific floor command
type: Class
subclass of: Command
comment: A type of command to send a car to a specific floor

Set out of service command
type: Class
subclass of: Command
comment: A type of command to set a lift out of service

Set real time mode command
type: Class
subclass of: Command
comment: A type of command to set the real time mode

Signal
type: Class
subclass of: Restriction
  on property: is measured in
  some values from: Unit of measure
subclass of: Restriction
  on property: is associated to
  some values from: FeatureOfInterest
subclass of: Restriction
  on property: has timestamp
  some values from: dateTime
subclass of: Restriction
  on property: has value
  qualified cardinality: 1
  on data range: rational

Smart Lift Edge Component
type: Class
subclass of: Device
subclass of: System
comment: A Smart Lift Edge Component is dedicated to the hosting of smar lift additional modules in the case that they are not hosted directly in the Smart Lift Edge Control Unit. An example could be the case of an additional earthquake sensor added after the lift deployment and not controlled by the Smart Lift Edge Control Unit.

Smart Lift Edge Control Unit
type: Class
subclass of: Device
subclass of: System
comment: A Smart Lift Edge Control Unit is the main element of a Smart Lift installation and it is typically associated with the lift control cabinet

Smart Lift Group
type: Class
subclass of: FeatureOfInterest
subclass of: System
comment: A Smart Lift Group represents the correlation of multiple Smart Lifts Installation and it is supported by the introduction of a Smart Lift Group identifier common each Smart Lifts Installation belonging to the same Smart Lift Group. Such kind of installations usually presents control units connected one each other to coordinate the movement and position of the different lifts, where the common commands (e.g. the call buttons) are given to one of these control units that acts as a principal master and coordinates the other installations or is composed by peer installations that coordinates one each othe

Smart lift Installation
type: Class
subclass of: Feature
subclass of: FeatureOfInterest
subclass of: System
subclass of: Restriction
  on property: has limit load
  some values from: Load
subclass of: Restriction
  on property: supports network technology
  some values from: Network
subclass of: Restriction
  on property: has sub system
  some values from: Smart Lift Edge Component
subclass of: Restriction
  on property: has sub system
  some values from: Smart Lift Edge Control Unit
subclass of: Restriction
  on property: has car stops
  some values from: integer
subclass of: Restriction
  on property: has location validator
  some values from: string
subclass of: Restriction
  on property: has main emergency number
  some values from: string
subclass of: Restriction
  on property: has maintenance company
  some values from: string
subclass of: Restriction
  on property: has secondary emergency telephone number
  some values from: string
subclass of: Restriction
  on property: has telephone number
  some values from: string
comment: A Smart Lift Installation in the Smart Lift System corresponds to a single lift, with all its elements.

Smart lift platform
type: Class
subclass of: Smart lift Installation

Standard emergency power supply signal
type: Class
subclass of: Power supply signal

Statistic signal
type: Class
subclass of: Signal

Status signal
type: Class
subclass of: Car signal

Test emergency number command
type: Class
subclass of: Command
comment: A type of command to test the emergency number

Test ride
type: Class
subclass of: Status signal

Test ride command
type: Class
subclass of: Command
comment: A type of command to test the ride

Time of confirmation of last periodic test 72h attempt
type: Class
subclass of: Bidirectional communication system signal

Time of last periodic test 72h attempt
type: Class
subclass of: Bidirectional communication system signal

Total floors covered
type: Class
subclass of: Statistic signal

Total reset sequence
type: Class
subclass of: Statistic signal

Total reverse direction
type: Class
subclass of: Statistic signal

Total time opened
type: Class
subclass of: Statistic signal

Upward travels
type: Class
subclass of: Statistic signal

System
type: Class
comment: The class of systems, i.e., systems virtually isolated from the environment, whose behaviour and interactions with the environment are modeled. Systems can be connected to other systems. Connected systems interact in some ways. Systems can also have subsystems. Properties of subsystems somehow contribute to the properties of the supersystem.

Percentage
type: NamedIndividual
type: Unit of measure

Network 2G
type: NamedIndividual
type: Network

Network 3G
type: NamedIndividual
type: Network

Network 4G
type: NamedIndividual
type: Network

Network 5G
type: NamedIndividual
type: Network

Network fixed line
type: NamedIndividual
type: Network