SAREF4AGRI: an extension of SAREF for the agriculture and food domain
type: Ontology
description: This ontology extends the SAREF ontology for the Agricultural domain. This work has been developed in the context of the STF 534 (https://portal.etsi.org/STF/STFs/STFHomePages/STF534.aspx), which was established with the goal to create three SAREF extensions, one of them for the Agricultural domain.
created: 2019-04-15
creator: mpoveda
creator: me
creator: lauradaniele
creator: mderoode
contributor: Jack Verhoosel
description: SAREF4AGRI is an extension of SAREF for the agriculture and food domain. SAREF4AGRI is specified and published by ETSI in the TS 103 410-6 associated to this ontology file. The list of use cases, standards and requirements that guided the creation of SAREF4AGRI are described in the associated ETSI TR 103 511.
license: etsi-software-license
modified: 2024-06-05
publisher: www.etsi.org
source: saref4agri
import: v3.2.1
preferred namespace prefix: s4agri
version IRI: v2.1.1
prior version: v1.1.2
version info: v2.1.1
imports: v3.2.1

altitude
type: DatatypeProperty
comment: The WGS84 altitude of a SpatialThing (decimal meters above the local reference ellipsoid).
domain: SpatialThing

latitude
type: DatatypeProperty
comment: The WGS84 latitude of a SpatialThing (decimal degrees).
domain: SpatialThing

location
type: ObjectProperty
comment: The relation between something and the point, or other geometrical thing in space, where it is. For example, the realtionship between a radio tower and a Point with a given lat and long. Or a relationship between a park and its outline as a closed arc of points, or a road and its location as a arc (a sequence of points). Clearly in practice there will be limit to the accuracy of any such statement, but one would expect an accuracy appropriate for the size of the object and uses such as mapping .
sub property of: based near

longitude
type: ObjectProperty
comment: The WGS84 longitude of a SpatialThing (decimal degrees).
domain: SpatialThing

has taxon rank
type: ObjectProperty

has geometry
type: ObjectProperty
domain: Feature
range: Geometry
comment: A spatial representation for a given feature.

contains
type: ObjectProperty
domain: SpatialObject
range: SpatialObject
comment: Exists if the subject SpatialObject spatially contains the object SpatialObject. DE-9IM: T*****FF*

within
type: ObjectProperty
domain: SpatialObject
range: SpatialObject
comment: Exists if the subject SpatialObject is spatially within the object SpatialObject. DE-9IM: T*F**F***

host
type: ObjectProperty
inverse of: is hosted by
comment: Relation between a platform and the systems it hosts.

is hosted by
type: ObjectProperty
comment: Relation between a system and its hosting platform.

deployed on platform
type: ObjectProperty
inverse of: in deployment
comment: Relation between a deployment and the platform(s) involved in the deployment.

deployed system
type: ObjectProperty
inverse of: has deployment
comment: Relation between a deployment and the system deployed.

has deployment
type: ObjectProperty

has subsystem
type: ObjectProperty

in deployment
type: ObjectProperty
comment: Relation between a platform and the deployment(s) that takes place in the platform.

member
type: ObjectProperty

contains
type: ObjectProperty
comment: contains
sub property of: contains
inverse of: is contained in

generates
type: ObjectProperty
sub property of: hasProperty
comment: A relation to represent the yield generated by a Crop.

has deployment period
type: ObjectProperty
comment: Relation to indicate the temporal duration or period of a deployment.
comment: has deployment period

has member
type: ObjectProperty
inverse of: is member of
comment: A relation to represent the members of an AnimalGroup.

has received
type: ObjectProperty
inverse of: receives
comment: has received

is contained in
type: ObjectProperty
comment: is contained in

is deployed at space
type: ObjectProperty
comment: Relation to indicate the geographical componet of a deployment.
comment: is deployed at space

is located in
type: ObjectProperty
inverse of: is location of
comment: A relation to express the physical location of a saref4agri entity (e.g., an animal)

is location of
type: ObjectProperty
comment: is location of

is member of
type: ObjectProperty
comment: A relation to express that an animal can be part of groups.

manages farm
type: ObjectProperty
comment: manages farm

receives
type: ObjectProperty
sub property of: hasMeasurement
comment: A relation to represent the intake/consumption of certain substances in a Crop.

has birth date
type: DatatypeProperty
range: dateTime
comment: A relation to express the birth date of an animal.

has death date
type: DatatypeProperty
range: dateTime
comment: A relation to express the death date of an animal.

has harvest date
type: DatatypeProperty
sub property of: topDataProperty
range: dateTime
comment: A relation to express the day the crop is harvested.

has plant date
type: DatatypeProperty
sub property of: topDataProperty
range: dateTime
comment: A relation to express the day the crop is planted.

Taxon rank
type: Class

Feature
type: Class
subclass of: SpatialObject
subclass of: Restriction
  on property: has geometry
  all values from: Geometry
disjoint with: Geometry
comment: This class represents the top-level feature type. This class is equivalent to GFI_Feature defined in ISO 19156:2011, and it is superclass of all feature types.

Geometry
type: Class
subclass of: SpatialObject
comment: The class represents the top-level geometry type. This class is equivalent to the UML class GM_Object defined in ISO 19107, and it is superclass of all geometry types.

SpatialObject
type: Class
subclass of: Restriction
  on property: has geometry
  all values from: Geometry
subclass of: Restriction
  on property: contains
  all values from: SpatialObject
subclass of: Restriction
  on property: within
  all values from: SpatialObject
subclass of: Restriction
  on property: location
  all values from: Point
comment: The class spatial-object represents everything that can have a spatial representation. It is superclass of feature and geometry.

Point
type: Class
comment: Uniquely identified by lat/long/alt. i.e. spaciallyIntersects(P1, P2) :- lat(P1, LAT), long(P1, LONG), alt(P1, ALT), lat(P2, LAT), long(P2, LONG), alt(P2, ALT). sameThing(P1, P2) :- type(P1, Point), type(P2, Point), spaciallyIntersects(P1, P2).
comment: A point, typically described using a coordinate system relative to Earth, such as WGS84.

Platform
type: Class
comment: A Platform is an entity that hosts other entities, particularly Sensors, Actuators, Samplers, and other Platforms (definition taken from http://www.w3.org/ns/sosa/Platform)

Deployment
type: Class

System
type: Class
comment: System is a unit of abstraction for pieces of infrastructure that implement Procedures. A System may have components, its subsystems, which are other Systems. (Definition taken from http://www.w3.org/ns/ssn/System)

Animal
type: Class
subclass of: FeatureOfInterest
subclass of: Restriction
  on property: has taxon rank
  some values from: Taxon rank
subclass of: Restriction
  on property: is located in
  some values from: Feature
subclass of: Restriction
  on property: is member of
  some values from: Animal Group
subclass of: Restriction
  on property: hasIdentifier
  max qualified cardinality: 1
  on data range: string
subclass of: Restriction
  on property: has birth date
  max qualified cardinality: 1
  on data range: dateTime
subclass of: Restriction
  on property: has death date
  max qualified cardinality: 1
  on data range: dateTime
comment: An individual and identifiable living organism that feeds on organic matter, typically having specialized sense organs and nervous system and able to respond rapidly to stimuli.

Animal Group
type: Class
subclass of: FeatureOfInterest
subclass of: Restriction
  on property: has member
  some values from: Animal
subclass of: Restriction
  on property: is located in
  some values from: Feature
comment: A collection of one or multiple animals.

Building
type: Class
subclass of: Feature
subclass of: Restriction
  on property: contains
  some values from: Building space
comment: A building represents a structure that provides shelter for its occupants or contents and stands in one place. The building is also used to provide a basic element within the spatial structure hierarchy for the components of a building project (together with site, storey, and space).

Building space
type: Class
subclass of: Feature
comment: An entity used to define the physical spaces of the building. A building space contains devices or building objects.

Crop
type: Class
subclass of: FeatureOfInterest
subclass of: Restriction
  on property: has taxon rank
  some values from: Taxon rank
subclass of: Restriction
  on property: has harvest date
  some values from: dateTime
subclass of: Restriction
  on property: has plant date
  some values from: dateTime
comment: A collection of cultivated plants that is grown on a large scale commercially, especially a cereal, fruit, or vegetable.

Deployment
type: Class
subclass of: Deployment
subclass of: Restriction
  on property: deployed on platform
  some values from: Platform
subclass of: Restriction
  on property: deployed system
  some values from: System
subclass of: Restriction
  on property: has deployment period
  some values from: Interval
subclass of: Restriction
  on property: is deployed at space
  some values from: SpatialObject
comment: Deployment
comment: The scenario, including temporal and spatial information, in which the systems and devices are installed.

Eating activity sensor
type: Class
subclass of: Sensor
comment: Eating activity sensor

Farm
type: Class
subclass of: Feature
subclass of: Restriction
  on property: contains
  some values from: Building
subclass of: Restriction
  on property: contains
  some values from: Parcel
comment: A plot of land used for the scope of farming which can contain buildings and parcels.

Farm holding
type: Class
subclass of: Organization
subclass of: Restriction
  on property: manages farm
  some values from: Farm
comment: A class to decsribe a saref4agri farm holding as subcass of a foaf:Organization

Farmer
type: Class
subclass of: Person
subclass of: Restriction
  on property: manages farm
  some values from: Farm
comment: A class to decsribe a saref4agri farmer as subcass of a foaf:Person

Milking sensor
type: Class
subclass of: Sensor
comment: Milking sensor

Movement activity sensor
type: Class
subclass of: Sensor
comment: Movement activity sensor

Parcel
type: Class
subclass of: Feature
subclass of: Restriction
  on property: contains
  some values from: Crop
comment: An area of land, which might be used for grazing animals or planting crops. The parcel is defined as an undividable logical area of land which contains homogeneous items.

Platform
type: Class
subclass of: Platform
comment: Platform

Pluviometer
type: Class
subclass of: Sensor
comment: A sensor that measures the rain fall.

Soil
type: Class
subclass of: FeatureOfInterest
comment: Upper layer of the earth in which plants grow.

Soil tensiometer
type: Class
subclass of: Sensor
comment: A sensor that measures the soil moisture.

Thermometer
type: Class
subclass of: Sensor
comment: Thermometer

Watering gun
type: Class
subclass of: Actuator
comment: An actuator to irrigate an space.

Watering system
type: Class
subclass of: System
comment: Watering system

Watering valve
type: Class
subclass of: Actuator
comment: Watering valve

Weather station
type: Class
subclass of: System
subclass of: Sensor
comment: A sensor o system that measure weather conditions.

Weight sensor
type: Class
subclass of: Sensor
comment: Weight sensor

decibel-milliwatts
type: NamedIndividual
type: UnitOfMeasure

Air temperature
type: NamedIndividual
type: Temperature
comment: The degree or intensity of heat present in the air.

Ambient humidity
type: NamedIndividual
type: Humidity
comment: The amount of water vapour in the air.

Irrigation water
type: NamedIndividual
type: Property
comment: The amount of water falling in the soil by irrigation methods.

Plant growth stage
type: NamedIndividual
type: Property
comment: The level or stage of growth of the plant.

Precipitation
type: NamedIndividual
type: Property
comment: The amount of water falling in the soil by natural process (e.g. rain).

Soil moisture
type: NamedIndividual
type: Property
comment: The amount of water or humidity contained in the soil.

Soil temperature
type: NamedIndividual
type: Temperature
comment: The degree or intensity of heat present in the soil.

Intake
type: Property
comment: The amount of food or other substance taken into the body of an animal or into the soil.

Yield
type: Property
comment: The produced amount of food for animals or of agricultural products.